Reaction Details
TargetMatrix metalloproteinase-14
LigandBDBM50388914
Substrate/Competitorn/a
Meas. Tech.ChEMBL_831080 (CHEMBL2065781)
Ki 90±n/a nM
Citation Lee, MIkejiri, MKlimpel, DToth, MEspahbodi, MHesek, DForbes, CKumarasiri, MNoll, BCChang, MMobashery, S Structure-Activity Relationship for Thiirane-Based Gelatinase Inhibitors. ACS Med Chem Lett3:490-495 (2012) 
 
Matrix metalloproteinase-14
Name:Matrix metalloproteinase-14
Type:Protein
Mol. Mass.:65900.19
Organism:Homo sapiens (Human)
Description:P50281
Residue:582
BDBM50388914
NameBDBM50388914
Synonyms:CHEMBL2063274 | US10357546, p-OH SB-3CT
TypeSmall organic molecule
Emp. Form.C15H14O4S2
Mol. Mass.322.399
SMILESOc1ccc(Oc2ccc(cc2)S(=O)(=O)CC2CS2)cc1