Reaction Details
TargetDiacylglycerol O-acyltransferase 1
LigandBDBM50388921
Substrate/Competitorn/a
Meas. Tech.ChEMBL_831086 (CHEMBL2065832)
IC50 28±n/a nM
Citation Serrano-Wu, MHCoppola, GMGong, YNeubert, ADChatelain, RClairmont, KBCommerford, RCosker, TDaniels, THou, YJain, MJuedes, MLi, LMullarkey, TRocheford, ESung, MJTyler, AYang, QYoon, THubbard, BK Intestinally Targeted Diacylglycerol Acyltransferase 1 (DGAT1) Inhibitors Robustly Suppress Postprandial Triglycerides. ACS Med Chem Lett3:411-415 (2012) 
 
Diacylglycerol O-acyltransferase 1
Name:Diacylglycerol O-acyltransferase 1
Type:Protein
Mol. Mass.:55297.82
Organism:Homo sapiens (Human)
Description:O75907
Residue:488
BDBM50388921
NameBDBM50388921
Synonyms:CHEMBL2063281
TypeSmall organic molecule
Emp. Form.C26H25N3O4
Mol. Mass.443.4944
SMILESCc1ccc(NC(=O)c2ccc3nc([nH]c3c2)-c2c(C)cc(OCC(O)=O)cc2C)cc1C