Reaction Details
TargetProstaglandin G/H synthase 1
LigandBDBM50110164
Substrate/Competitorn/a
Meas. Tech.ChEMBL_832832 (CHEMBL2066345)
IC50 115±n/a nM
Citation Liedtke, AJCrews, BCDaniel, CMBlobaum, ALKingsley, PJGhebreselasie, KMarnett, LJ Cyclooxygenase-1-selective inhibitors based on the (E)-2'-des-methyl-sulindac sulfide scaffold. J Med Chem55:2287-300 (2012) 
 
Prostaglandin G/H synthase 1
Name:Prostaglandin G/H synthase 1
Type:Enzyme
Mol. Mass.:68692.62
Organism:Homo sapiens (Human)
Description:P23219
Residue:599
BDBM50110164
NameBDBM50110164
Synonyms:(Z)-2-(3-(4-(methylthio)benzylidene)-6-fluoro-2-methyl-3H-inden-1-yl)acetic acid CHEMBL18797 Sulindac sulphide cid_5352624 {6-Fluoro-2-methyl-3-[1-[4-(methyl-lambda*4*-sulfanyl)-phenyl]-meth-(E)-ylidene]-3H-inden-1-yl}-acetic acid
TypeSmall organic molecule
Emp. Form.C20H17FO2S
Mol. Mass.340.411
SMILESCSc1ccc(\C=C2\C(C)=C(CC(O)=O)c3cc(F)ccc23)cc1