Reaction Details
TargetE3 ubiquitin-protein ligase XIAP
LigandBDBM50388968
Substrate/Competitorn/a
Meas. Tech.ChEMBL_833598 (CHEMBL2066539)
Ki 410±n/a nM
Citation Flygare, JABeresini, MBudha, NChan, HChan, ITCheeti, SCohen, FDeshayes, KDoerner, KEckhardt, SGElliott, LOFeng, BFranklin, MCReisner, SFGazzard, LHalladay, JHymowitz, SGLa, HLoRusso, PMaurer, BMurray, LPlise, EQuan, CStephan, JPYoung, SGTom, JTsui, VUm, JVarfolomeev, EVucic, DWagner, AJWallweber, HJWang, LWare, JWen, ZWong, HWong, JMWong, MWong, SYu, RZobel, KFairbrother, WJ Discovery of a potent small-molecule antagonist of inhibitor of apoptosis (IAP) proteins and clinical candidate for the treatment of cancer (GDC-0152). J Med Chem55:4101-13 (2012) 
 
E3 ubiquitin-protein ligase XIAP
Name:E3 ubiquitin-protein ligase XIAP
Type:Protein
Mol. Mass.:56685.27
Organism:Homo sapiens (Human)
Description:P98170
Residue:497
BDBM50388968
NameBDBM50388968
Synonyms:CHEMBL2063866
TypeSmall organic molecule
Emp. Form.C31H42N4O3
Mol. Mass.518.6902
SMILESCN[C@@H](C)C(=O)N[C@@H](C1CCCCC1)C(=O)N1CCC[C@H]1C(=O)NCC(c1ccccc1)c1ccccc1