Reaction Details
TargetBaculoviral IAP repeat-containing protein 2
LigandBDBM50388975
Substrate/Competitorn/a
Meas. Tech.ChEMBL_833600 (CHEMBL2066541)
Ki 17±n/a nM
Citation Flygare, JABeresini, MBudha, NChan, HChan, ITCheeti, SCohen, FDeshayes, KDoerner, KEckhardt, SGElliott, LOFeng, BFranklin, MCReisner, SFGazzard, LHalladay, JHymowitz, SGLa, HLoRusso, PMaurer, BMurray, LPlise, EQuan, CStephan, JPYoung, SGTom, JTsui, VUm, JVarfolomeev, EVucic, DWagner, AJWallweber, HJWang, LWare, JWen, ZWong, HWong, JMWong, MWong, SYu, RZobel, KFairbrother, WJ Discovery of a potent small-molecule antagonist of inhibitor of apoptosis (IAP) proteins and clinical candidate for the treatment of cancer (GDC-0152). J Med Chem55:4101-13 (2012) 
 
Baculoviral IAP repeat-containing protein 2
Name:Baculoviral IAP repeat-containing protein 2
Type:Protein
Mol. Mass.:69900.47
Organism:Homo sapiens (Human)
Description:Q13490
Residue:618
BDBM50388975
NameBDBM50388975
Synonyms:CHEMBL2063869
TypeSmall organic molecule
Emp. Form.C25H34N6O3S
Mol. Mass.498.641
SMILESCN[C@@H](C)C(=O)N[C@@H](C1CCCCC1)C(=O)N1CCC[C@H]1C(=O)Nc1snnc1-c1ccccc1