Reaction Details
TargetMax-like protein X
LigandBDBM50388973
Substrate/Competitorn/a
Meas. Tech.ChEMBL_833604 (CHEMBL2066545)
Ki 90±n/a nM
Citation Flygare, JABeresini, MBudha, NChan, HChan, ITCheeti, SCohen, FDeshayes, KDoerner, KEckhardt, SGElliott, LOFeng, BFranklin, MCReisner, SFGazzard, LHalladay, JHymowitz, SGLa, HLoRusso, PMaurer, BMurray, LPlise, EQuan, CStephan, JPYoung, SGTom, JTsui, VUm, JVarfolomeev, EVucic, DWagner, AJWallweber, HJWang, LWare, JWen, ZWong, HWong, JMWong, MWong, SYu, RZobel, KFairbrother, WJ Discovery of a potent small-molecule antagonist of inhibitor of apoptosis (IAP) proteins and clinical candidate for the treatment of cancer (GDC-0152). J Med Chem55:4101-13 (2012) 
 
Max-like protein X
Name:Max-like protein X
Type:PROTEIN
Mol. Mass.:33306.36
Organism:Homo sapiens (Human)
Description:ChEMBL_833604
Residue:298
BDBM50388973
NameBDBM50388973
Synonyms:CHEMBL2063867
TypeSmall organic molecule
Emp. Form.C24H35ClN4O3
Mol. Mass.463.013
SMILESCN[C@@H](C)C(=O)N[C@@H](C1CCCCC1)C(=O)N1CCC[C@H]1C(=O)NCc1ccc(Cl)cc1