Reaction Details
TargetVascular endothelial growth factor receptor 2
LigandBDBM50388976
Substrate/Competitorn/a
Meas. Tech.ChEMBL_831216 (CHEMBL2066138)
Kd 16±n/a nM
Citation Kuchar, MOliveira, MCGano, LSantos, IKniess, T Radioiodinated sunitinib as a potential radiotracer for imaging angiogenesis-radiosynthesis and first radiopharmacological evaluation of 5-[125I]Iodo-sunitinib. Bioorg Med Chem Lett22:2850-5 (2012) 
 
Vascular endothelial growth factor receptor 2
Name:Vascular endothelial growth factor receptor 2
Type:Receptor Tyrosine Kinase
Mol. Mass.:151510.97
Organism:Homo sapiens (Human)
Description:P35968
Residue:1356
BDBM50388976
NameBDBM50388976
Synonyms:CHEMBL2063878
TypeSmall organic molecule
Emp. Form.C22H27IN4O2
Mol. Mass.506.3799
SMILESCCN(CC)CCNC(=O)c1c(C)[nH]c(\C=C2/C(=O)Nc3ccc(I)cc23)c1C