Reaction Details
TargetApoptosis regulator Bcl-2
LigandBDBM50388986
Substrate/Competitorn/a
Meas. Tech.ChEMBL_832857 (CHEMBL2066619)
Ki 1.5±n/a nM
Citation Zhou, HChen, JMeagher, JLYang, CYAguilar, ALiu, LBai, LCong, XCai, QFang, XStuckey, JAWang, S Design of Bcl-2 and Bcl-xL inhibitors with subnanomolar binding affinities based upon a new scaffold. J Med Chem55:4664-82 (2012) 
 
Apoptosis regulator Bcl-2
Name:Apoptosis regulator Bcl-2
Type:Homodimer or heterodimer
Mol. Mass.:26269.11
Organism:Homo sapiens (Human)
Description:P10415
Residue:239
BDBM50388986
NameBDBM50388986
Synonyms:CHEMBL2063886
TypeSmall organic molecule
Emp. Form.C55H63ClN8O7S2
Mol. Mass.1047.721
SMILESCN(C)CC[C@H](CSc1ccccc1)Nc1ccc(cc1[N+]([O-])=O)S(=O)(=O)Nc1ccc(cc1)C#Cc1cccc(c1)-c1c(cn(CC[C@H](O)CO)c1C(=O)NCCCN1CCN(C)CC1)-c1ccc(Cl)cc1