Reaction Details
TargetC3a anaphylatoxin chemotactic receptor
LigandBDBM50389002
Substrate/Competitorn/a
Meas. Tech.ChEMBL_832878 (CHEMBL2066640)
EC50 489.78±n/a nM
Citation Bellows-Peterson, MLFung, HKFloudas, CAKieslich, CAZhang, LMorikis, DWareham, KJMonk, PNHawksworth, OAWoodruff, TM De novo peptide design with C3a receptor agonist and antagonist activities: theoretical predictions and experimental validation. J Med Chem55:4159-68 (2012) 
 
C3a anaphylatoxin chemotactic receptor
Name:C3a anaphylatoxin chemotactic receptor
Type:PROTEIN
Mol. Mass.:53864.66
Organism:Homo sapiens (Human)
Description:ChEMBL_642034
Residue:482
BDBM50389002
NameBDBM50389002
Synonyms:CHEMBL2064017
TypeSmall organic molecule
Emp. Form.C93H141N31O20
Mol. Mass.2013.3103
SMILESCC(C)C[C@H](NC(=O)CNC(=O)[C@H](CC(C)C)NC(=O)[C@H](CCCCN)NC(=O)[C@H](CC(O)=O)NC(=O)[C@H](C)NC(=O)[C@H](CCCN=C(N)N)NC(=O)[C@H](Cc1c[nH]c2ccccc12)NC(=O)[C@H](CCCN=C(N)N)NC(=O)[C@H](CCCN=C(N)N)NC(=O)[C@@H](NC(=O)[C@H](Cc1c[nH]c2ccccc12)NC(=O)[C@H](Cc1c[nH]c2ccccc12)NC(C)=O)[C@@H](C)O)C(=O)N[C@@H](C)C(=O)N[C@@H](CCCN=C(N)N)C(O)=O