Reaction Details
TargetSigma non-opioid intracellular receptor 1
LigandBDBM50321786
Substrate/Competitorn/a
Meas. Tech.ChEMBL_833107 (CHEMBL2067311)
Ki 2.3±n/a nM
Citation Oberdorf, CSchepmann, DVela, JMBuschmann, HHolenz, JWünsch, B Thiophene bioisosteres of spirocyclics receptor ligands: relationships between substitution pattern ands receptor affinity. J Med Chem55:5350-60 (2012) 
 
Sigma non-opioid intracellular receptor 1
Name:Sigma non-opioid intracellular receptor 1
Type:Protein
Mol. Mass.:25307.17
Organism:Cavia porcellus (Guinea pig)
Description:Q60492
Residue:223
BDBM50321786
NameBDBM50321786
Synonyms:(R)-1-benzyl-2'-(dimethoxymethyl)-6'-methoxy-6',7'-dihydrospiro[piperidine-4,4'-thieno[3,2-c]pyran] | CHEMBL1169778
TypeSmall organic molecule
Emp. Form.C22H29NO4S
Mol. Mass.403.535
SMILESCOC(OC)c1cc2c(C[C@H](OC)OC22CCN(Cc3ccccc3)CC2)s1