Reaction Details
TargetProtein kinase C alpha type
LigandBDBM50389079
Substrate/Competitorn/a
Meas. Tech.ChEMBL_833715 (CHEMBL2066814)
IC50>100000±n/a nM
Citation Lo Monte, FKramer, TGu, JAnumala, URMarinelli, LLa Pietra, VNovellino, EFranco, BDemedts, DVan Leuven, FFuertes, ADominguez, JMPlotkin, BEldar-Finkelman, HSchmidt, B Identification of glycogen synthase kinase-3 inhibitors with a selective sting for glycogen synthase kinase-3a. J Med Chem55:4407-24 (2012) 
 
Protein kinase C alpha type
Name:Protein kinase C alpha type
Type:Enzyme
Mol. Mass.:76755.65
Organism:Homo sapiens (Human)
Description:The recombinant human PKC enzymes were produced using a baculovirus expression system in SF9 cells
Residue:672
BDBM50389079
NameBDBM50389079
Synonyms:CHEMBL2064532
TypeSmall organic molecule
Emp. Form.C23H14FN3O3S
Mol. Mass.431.439
SMILESFc1ccc(-c2ccc(CSc3nnc(o3)-c3ccc4OCOc4c3)cc2)c(c1)C#N