Reaction Details
TargetAurora kinase A
LigandBDBM50389079
Substrate/Competitorn/a
Meas. Tech.ChEMBL_833716 (CHEMBL2066815)
IC50 30000±n/a nM
Citation Lo Monte, FKramer, TGu, JAnumala, URMarinelli, LLa Pietra, VNovellino, EFranco, BDemedts, DVan Leuven, FFuertes, ADominguez, JMPlotkin, BEldar-Finkelman, HSchmidt, B Identification of glycogen synthase kinase-3 inhibitors with a selective sting for glycogen synthase kinase-3a. J Med Chem55:4407-24 (2012) 
 
Aurora kinase A
Name:Aurora kinase A
Type:Serine/threonine-protein kinase
Mol. Mass.:45830.98
Organism:Homo sapiens (Human)
Description:O14965
Residue:403
BDBM50389079
NameBDBM50389079
Synonyms:CHEMBL2064532
TypeSmall organic molecule
Emp. Form.C23H14FN3O3S
Mol. Mass.431.439
SMILESFc1ccc(-c2ccc(CSc3nnc(o3)-c3ccc4OCOc4c3)cc2)c(c1)C#N