Reaction Details
TargetAurora kinase A
LigandBDBM50389081
Substrate/Competitorn/a
Meas. Tech.ChEMBL_833716 (CHEMBL2066815)
IC50>100000±n/a nM
Citation Lo Monte, FKramer, TGu, JAnumala, URMarinelli, LLa Pietra, VNovellino, EFranco, BDemedts, DVan Leuven, FFuertes, ADominguez, JMPlotkin, BEldar-Finkelman, HSchmidt, B Identification of glycogen synthase kinase-3 inhibitors with a selective sting for glycogen synthase kinase-3a. J Med Chem55:4407-24 (2012) 
 
Aurora kinase A
Name:Aurora kinase A
Type:Serine/threonine-protein kinase
Mol. Mass.:45830.98
Organism:Homo sapiens (Human)
Description:O14965
Residue:403
BDBM50389081
NameBDBM50389081
Synonyms:CHEMBL2064534
TypeSmall organic molecule
Emp. Form.C24H17N3O3S
Mol. Mass.427.475
SMILESN#Cc1ccccc1-c1ccc(CSc2nnc(o2)-c2ccc3OCCOc3c2)cc1