Reaction Details
TargetGlycogen synthase kinase-3 beta
LigandBDBM50389088
Substrate/Competitorn/a
Meas. Tech.ChEMBL_833720 (CHEMBL2066819)
IC50 65±n/a nM
Citation Lo Monte, FKramer, TGu, JAnumala, URMarinelli, LLa Pietra, VNovellino, EFranco, BDemedts, DVan Leuven, FFuertes, ADominguez, JMPlotkin, BEldar-Finkelman, HSchmidt, B Identification of glycogen synthase kinase-3 inhibitors with a selective sting for glycogen synthase kinase-3a. J Med Chem55:4407-24 (2012) 
 
Glycogen synthase kinase-3 beta
Name:Glycogen synthase kinase-3 beta
Type:Enzyme
Mol. Mass.:46756.38
Organism:Homo sapiens (Human)
Description:P49841
Residue:420
BDBM50389088
NameBDBM50389088
Synonyms:CHEMBL2064516
TypeSmall organic molecule
Emp. Form.C17H11N3O3S
Mol. Mass.337.353
SMILESN#Cc1cccc(CSc2nnc(o2)-c2ccc3OCOc3c2)c1