Reaction Details
TargetGlycogen synthase kinase-3 beta
LigandBDBM50389087
Substrate/Competitorn/a
Meas. Tech.ChEMBL_833720 (CHEMBL2066819)
IC50 39±n/a nM
Citation Lo Monte, FKramer, TGu, JAnumala, URMarinelli, LLa Pietra, VNovellino, EFranco, BDemedts, DVan Leuven, FFuertes, ADominguez, JMPlotkin, BEldar-Finkelman, HSchmidt, B Identification of glycogen synthase kinase-3 inhibitors with a selective sting for glycogen synthase kinase-3a. J Med Chem55:4407-24 (2012) 
 
Glycogen synthase kinase-3 beta
Name:Glycogen synthase kinase-3 beta
Type:Enzyme
Mol. Mass.:46756.38
Organism:Homo sapiens (Human)
Description:P49841
Residue:420
BDBM50389087
NameBDBM50389087
Synonyms:CHEMBL2064533
TypeSmall organic molecule
Emp. Form.C23H15N3O3S
Mol. Mass.413.449
SMILESN#Cc1ccccc1-c1ccc(CSc2nnc(o2)-c2ccc3OCOc3c2)cc1