Reaction Details
TargetGlycogen synthase kinase-3 beta
LigandBDBM50389082
Substrate/Competitorn/a
Meas. Tech.ChEMBL_833720 (CHEMBL2066819)
IC50 41±n/a nM
Citation Lo Monte, FKramer, TGu, JAnumala, URMarinelli, LLa Pietra, VNovellino, EFranco, BDemedts, DVan Leuven, FFuertes, ADominguez, JMPlotkin, BEldar-Finkelman, HSchmidt, B Identification of glycogen synthase kinase-3 inhibitors with a selective sting for glycogen synthase kinase-3a. J Med Chem55:4407-24 (2012) 
 
Glycogen synthase kinase-3 beta
Name:Glycogen synthase kinase-3 beta
Type:Enzyme
Mol. Mass.:46756.38
Organism:Homo sapiens (Human)
Description:P49841
Residue:420
BDBM50389082
NameBDBM50389082
Synonyms:CHEMBL2064536
TypeSmall organic molecule
Emp. Form.C21H14N4OS
Mol. Mass.370.427
SMILESN#Cc1ccccc1-c1ccc(CSc2nnc(o2)-c2ccncc2)cc1