Reaction Details
TargetGlycogen synthase kinase-3 alpha
LigandBDBM50389089
Substrate/Competitorn/a
Meas. Tech.ChEMBL_833721 (CHEMBL2066820)
IC50 15±n/a nM
Citation Lo Monte, FKramer, TGu, JAnumala, URMarinelli, LLa Pietra, VNovellino, EFranco, BDemedts, DVan Leuven, FFuertes, ADominguez, JMPlotkin, BEldar-Finkelman, HSchmidt, B Identification of glycogen synthase kinase-3 inhibitors with a selective sting for glycogen synthase kinase-3a. J Med Chem55:4407-24 (2012) 
 
Glycogen synthase kinase-3 alpha
Name:Glycogen synthase kinase-3 alpha
Type:Enzyme
Mol. Mass.:50991.79
Organism:Homo sapiens (Human)
Description:P49840
Residue:483
BDBM50389089
NameBDBM50389089
Synonyms:CHEMBL2064517
TypeSmall organic molecule
Emp. Form.C17H11N3O3S
Mol. Mass.337.353
SMILESN#Cc1ccc(CSc2nnc(o2)-c2ccc3OCOc3c2)cc1