Reaction Details
TargetGlycogen synthase kinase-3 alpha
LigandBDBM50389091
Substrate/Competitorn/a
Meas. Tech.ChEMBL_833721 (CHEMBL2066820)
IC50 45±n/a nM
Citation Lo Monte, FKramer, TGu, JAnumala, URMarinelli, LLa Pietra, VNovellino, EFranco, BDemedts, DVan Leuven, FFuertes, ADominguez, JMPlotkin, BEldar-Finkelman, HSchmidt, B Identification of glycogen synthase kinase-3 inhibitors with a selective sting for glycogen synthase kinase-3a. J Med Chem55:4407-24 (2012) 
 
Glycogen synthase kinase-3 alpha
Name:Glycogen synthase kinase-3 alpha
Type:Enzyme
Mol. Mass.:50991.79
Organism:Homo sapiens (Human)
Description:P49840
Residue:483
BDBM50389091
NameBDBM50389091
Synonyms:CHEMBL2064519
TypeSmall organic molecule
Emp. Form.C18H13N3O3S
Mol. Mass.351.379
SMILESN#Cc1ccc(CSc2nnc(o2)-c2ccc3OCCOc3c2)cc1