Reaction Details
TargetGlycogen synthase kinase-3 alpha
LigandBDBM50389093
Substrate/Competitorn/a
Meas. Tech.ChEMBL_833721 (CHEMBL2066820)
IC50 107±n/a nM
Citation Lo Monte, FKramer, TGu, JAnumala, URMarinelli, LLa Pietra, VNovellino, EFranco, BDemedts, DVan Leuven, FFuertes, ADominguez, JMPlotkin, BEldar-Finkelman, HSchmidt, B Identification of glycogen synthase kinase-3 inhibitors with a selective sting for glycogen synthase kinase-3a. J Med Chem55:4407-24 (2012) 
 
Glycogen synthase kinase-3 alpha
Name:Glycogen synthase kinase-3 alpha
Type:Enzyme
Mol. Mass.:50991.79
Organism:Homo sapiens (Human)
Description:P49840
Residue:483
BDBM50389093
NameBDBM50389093
Synonyms:CHEMBL2064522
TypeSmall organic molecule
Emp. Form.C17H12N6O3S
Mol. Mass.380.381
SMILESC(Sc1nnc(o1)-c1ccc2OCOc2c1)c1ccc(cc1)-c1nnn[nH]1