Reaction Details
TargetCyclin-dependent kinase 2
LigandBDBM50389116
Substrate/Competitorn/a
Meas. Tech.ChEMBL_832975 (CHEMBL2067019)
Ki 2000±n/a nM
Citation Guo, CMcAlpine, IZhang, JKnighton, DDKephart, SJohnson, MCLi, HBouzida, DYang, ADong, LMarakovits, JTikhe, JRichardson, PGuo, LCKania, REdwards, MPKraynov, EChristensen, JPiraino, JLee, JDagostino, EDel-Carmen, CDeng, YLSmeal, TMurray, BW Discovery of pyrroloaminopyrazoles as novel PAK inhibitors. J Med Chem55:4728-39 (2012) 
 
Cyclin-dependent kinase 2
Name:Cyclin-dependent kinase 2
Type:Enzyme Subunit
Mol. Mass.:33938.17
Organism:Homo sapiens (Human)
Description:P24941
Residue:298
BDBM50389116
NameBDBM50389116
Synonyms:CHEMBL2064561
TypeSmall organic molecule
Emp. Form.C25H29N5O3
Mol. Mass.447.5295
SMILESCN(C)C[C@@H](OC(=O)N1Cc2c(NC(=O)c3ccccc3)[nH]nc2C1(C)C)c1ccccc1