Reaction Details
TargetSerine/threonine-protein kinase PAK 4
LigandBDBM50389120
Substrate/Competitorn/a
Meas. Tech.ChEMBL_832969 (CHEMBL2066924)
EC50 28±n/a nM
Citation Guo, CMcAlpine, IZhang, JKnighton, DDKephart, SJohnson, MCLi, HBouzida, DYang, ADong, LMarakovits, JTikhe, JRichardson, PGuo, LCKania, REdwards, MPKraynov, EChristensen, JPiraino, JLee, JDagostino, EDel-Carmen, CDeng, YLSmeal, TMurray, BW Discovery of pyrroloaminopyrazoles as novel PAK inhibitors. J Med Chem55:4728-39 (2012) 
 
Serine/threonine-protein kinase PAK 4
Name:Serine/threonine-protein kinase PAK 4
Type:Protein
Mol. Mass.:64098.01
Organism:Homo sapiens (Human)
Description:O96013
Residue:591
BDBM50389120
NameBDBM50389120
Synonyms:CHEMBL2064565
TypeSmall organic molecule
Emp. Form.C24H28N6O3
Mol. Mass.448.5175
SMILESCN(C)C[C@@H](OC(=O)N1Cc2c(NC(=O)c3ccccn3)[nH]nc2C1(C)C)c1ccccc1