Reaction Details
TargetAdenosine receptor A3
LigandBDBM50389134
Substrate/Competitorn/a
Meas. Tech.ChEMBL_833205 (CHEMBL2067496)
Ki 0.530000±n/a nM
Citation Tosh, DKDeflorian, FPhan, KGao, ZGWan, TCGizewski, EAuchampach, JAJacobson, KA Structure-guided design of A(3) adenosine receptor-selective nucleosides: combination of 2-arylethynyl and bicyclo[3.1.0]hexane substitutions. J Med Chem55:4847-60 (2012) 
 
Adenosine receptor A3
Name:Adenosine receptor A3
Type:G Protein-Coupled Receptor (GPCR)
Mol. Mass.:36197.32
Organism:Homo sapiens (Human)
Description:P0DMS8
Residue:318
BDBM50389134
NameBDBM50389134
Synonyms:CHEMBL2064639
TypeSmall organic molecule
Emp. Form.C22H21FN6O3
Mol. Mass.436.4389
SMILESCNC(=O)[C@@]12C[C@@H]1[C@H]([C@H](O)[C@@H]2O)n1cnc2c(NC)nc(nc12)C#Cc1ccc(F)cc1