Reaction Details
TargetNUAK family SNF1-like kinase 1
LigandBDBM50389154
Substrate/Competitorn/a
Meas. Tech.ChEMBL_833222 (CHEMBL2067586)
IC50 26±n/a nM
Citation Gingrich, DELisko, JGCurry, MACheng, MQuail, MLu, LWan, WAlbom, MSAngeles, TSAimone, LDHaltiwanger, RCWells-Knecht, KOtt, GRGhose, AKAtor, MARuggeri, BDorsey, BD Discovery of an orally efficacious inhibitor of anaplastic lymphoma kinase. J Med Chem55:4580-93 (2012) 
 
NUAK family SNF1-like kinase 1
Name:NUAK family SNF1-like kinase 1
Type:PROTEIN
Mol. Mass.:74326.51
Organism:Homo sapiens (Human)
Description:ChEMBL_1451343
Residue:661
BDBM50389154
NameBDBM50389154
Synonyms:CHEMBL2064666
TypeSmall organic molecule
Emp. Form.C28H35ClN6O3
Mol. Mass.539.069
SMILESCOc1c(Nc2ncc(Cl)c(N[C@@H]3[C@@H]4C[C@@H](C=C4)[C@@H]3C(N)=O)n2)ccc2CC[C@@H](CCc12)N1CCOCC1