Reaction Details
TargetNeuronal acetylcholine receptor subunit alpha-4/beta-2
LigandBDBM82070
Substrate/Competitorn/a
Meas. Tech.ChEMBL_833017 (CHEMBL2067156)
EC50 1±n/a nM
Citation Bréthous, LGarcia-Delgado, NSchwartz, JBertrand, SBertrand, DReymond, JL Synthesis and nicotinic receptor activity of chemical space analogues of N-(3R)-1-azabicyclo[2.2.2]oct-3-yl-4-chlorobenzamide (PNU-282,987) and 1,4-diazabicyclo[3.2.2]nonane-4-carboxylic acid 4-bromophenyl ester (SSR180711). J Med Chem55:4605-18 (2012) 
 
Neuronal acetylcholine receptor subunit alpha-4/beta-2
Name:Neuronal acetylcholine receptor subunit alpha-4/beta-2
Type:Protein
Mol. Mass.:n/a
Description:n/a
Components:This complex has 2 components.
Component 1
Name:Neuronal acetylcholine receptor subunit alpha-4
Synonyms:ACHA4_HUMAN CHRNA4 protein Neuronal acetylcholine receptor protein alpha-4 subunit Nicotinic acetylcholine receptor alpha4/beta2/alpha5
Type:n/a
Mol. Mass.:69963.49
Organism:Homo sapiens (Human)
Description:NACHRA4
Residue:627
Component 2
Name:Neuronal acetylcholine receptor subunit beta-2
Synonyms:ACHB2_HUMAN Neuronal acetylcholine receptor protein beta-2 subunit | Nicotinic acetylcholine receptor alpha3/beta2/alpha5
Type:Protein
Mol. Mass.:57020.50
Organism:Homo sapiens (Human)
Description:P17787
Residue:502
BDBM82070
NameBDBM82070
Synonyms:CAS_29790-52-1 Nicotine-D salicylate US9303017, Nicotine
Typen/a
Emp. Form.C10H14N2
Mol. Mass.162.2316
SMILESCN1CCC[C@H]1c1cccnc1