Reaction Details
TargetTyrosine-protein kinase JAK2
LigandBDBM50389176
Substrate/Competitorn/a
Meas. Tech.ChEMBL_833247 (CHEMBL2067611)
IC50 1.5±n/a nM
Citation Dugan, BJGingrich, DEMesaros, EFMilkiewicz, KLCurry, MAZulli, ALDobrzanski, PSerdikoff, CJan, MAngeles, TSAlbom, MSMason, JLAimone, LDMeyer, SLHuang, ZWells-Knecht, KJAtor, MARuggeri, BADorsey, BD A selective, orally bioavailable 1,2,4-triazolo[1,5-a]pyridine-based inhibitor of Janus kinase 2 for use in anticancer therapy: discovery of CEP-33779. J Med Chem55:5243-54 (2012) 
 
Tyrosine-protein kinase JAK2
Name:Tyrosine-protein kinase JAK2
Type:Protein
Mol. Mass.:130684.68
Organism:Homo sapiens (Human)
Description:O60674
Residue:1132
BDBM50389176
NameBDBM50389176
Synonyms:CHEMBL2062796
TypeSmall organic molecule
Emp. Form.C19H16N4O2S
Mol. Mass.364.421
SMILESCS(=O)(=O)c1ccc(cc1)-c1cccn2nc(Nc3ccccc3)nc12