Reaction Details
TargetTyrosine-protein kinase JAK2
LigandBDBM99537
Substrate/Competitorn/a
Meas. Tech.ChEMBL_833247 (CHEMBL2067611)
IC50 1.8±n/a nM
Citation Dugan, BJGingrich, DEMesaros, EFMilkiewicz, KLCurry, MAZulli, ALDobrzanski, PSerdikoff, CJan, MAngeles, TSAlbom, MSMason, JLAimone, LDMeyer, SLHuang, ZWells-Knecht, KJAtor, MARuggeri, BADorsey, BD A selective, orally bioavailable 1,2,4-triazolo[1,5-a]pyridine-based inhibitor of Janus kinase 2 for use in anticancer therapy: discovery of CEP-33779. J Med Chem55:5243-54 (2012) 
 
Tyrosine-protein kinase JAK2
Name:Tyrosine-protein kinase JAK2
Type:Protein
Mol. Mass.:130684.68
Organism:Homo sapiens (Human)
Description:O60674
Residue:1132
BDBM99537
NameBDBM99537
Synonyms:CHEMBL2062804 | US8501936, 35
TypeSmall organic molecule
Emp. Form.C24H26N6O2S
Mol. Mass.462.567
SMILESCN1CCN(CC1)c1cccc(Nc2nc3c(cccn3n2)-c2ccc(cc2)S(C)(=O)=O)c1