Reaction Details
TargetAurora kinase A
LigandBDBM50349027
Substrate/Competitorn/a
Meas. Tech.ChEMBL_831542 (CHEMBL2066306)
IC50>1000±n/a nM
Citation Hsu, JTYeh, TKYen, SCChen, CTHsieh, SYHsu, TLu, CTChen, CHChou, LHChiu, CHChang, YITseng, YJYen, KRChao, YSLin, WHJiaang, WT 3-Phenyl-1H-5-pyrazolylamine-based derivatives as potent and efficacious inhibitors of FMS-like tyrosine kinase-3 (FLT3). Bioorg Med Chem Lett22:4654-9 (2012) 
 
Aurora kinase A
Name:Aurora kinase A
Type:Serine/threonine-protein kinase
Mol. Mass.:45830.98
Organism:Homo sapiens (Human)
Description:O14965
Residue:403
BDBM50349027
NameBDBM50349027
Synonyms:CHEMBL1807466
TypeSmall organic molecule
Emp. Form.C27H28N6O3S
Mol. Mass.516.615
SMILESCN1CCN(CC1)c1ccc(cc1)C(=O)Nc1cc(n[nH]1)-c1ccc(NS(=O)(=O)c2ccccc2)cc1