Reaction Details
TargetReceptor-type tyrosine-protein kinase FLT3
LigandBDBM50389229
Substrate/Competitorn/a
Meas. Tech.ChEMBL_831539 (CHEMBL2066303)
IC50 12±n/a nM
Citation Hsu, JTYeh, TKYen, SCChen, CTHsieh, SYHsu, TLu, CTChen, CHChou, LHChiu, CHChang, YITseng, YJYen, KRChao, YSLin, WHJiaang, WT 3-Phenyl-1H-5-pyrazolylamine-based derivatives as potent and efficacious inhibitors of FMS-like tyrosine kinase-3 (FLT3). Bioorg Med Chem Lett22:4654-9 (2012) 
 
Receptor-type tyrosine-protein kinase FLT3
Name:Receptor-type tyrosine-protein kinase FLT3
Type:Enzyme
Mol. Mass.:112888.62
Organism:Homo sapiens (Human)
Description:P36888
Residue:993
BDBM50389229
NameBDBM50389229
Synonyms:CHEMBL2063318
TypeSmall organic molecule
Emp. Form.C28H28N6O3
Mol. Mass.496.5603
SMILESCN1CCN(CC1)c1ccc(cc1)C(=O)Nc1cc(n[nH]1)-c1ccc(NC(=O)Oc2ccccc2)cc1