Reaction Details
TargetReceptor-type tyrosine-protein kinase FLT3
LigandBDBM50389230
Substrate/Competitorn/a
Meas. Tech.ChEMBL_831539 (CHEMBL2066303)
IC50 40±n/a nM
Citation Hsu, JTYeh, TKYen, SCChen, CTHsieh, SYHsu, TLu, CTChen, CHChou, LHChiu, CHChang, YITseng, YJYen, KRChao, YSLin, WHJiaang, WT 3-Phenyl-1H-5-pyrazolylamine-based derivatives as potent and efficacious inhibitors of FMS-like tyrosine kinase-3 (FLT3). Bioorg Med Chem Lett22:4654-9 (2012) 
 
Receptor-type tyrosine-protein kinase FLT3
Name:Receptor-type tyrosine-protein kinase FLT3
Type:Enzyme
Mol. Mass.:112888.62
Organism:Homo sapiens (Human)
Description:P36888
Residue:993
BDBM50389230
NameBDBM50389230
Synonyms:CHEMBL2063320
TypeSmall organic molecule
Emp. Form.C29H29N5O4
Mol. Mass.511.5717
SMILESO=C(Nc1ccc(cc1)-c1cc(NC(=O)c2ccc(OCCN3CCCC3)cc2)[nH]n1)Oc1ccccc1