Reaction Details
TargetVascular endothelial growth factor receptor 1
LigandBDBM50389215
Substrate/Competitorn/a
Meas. Tech.ChEMBL_831540 (CHEMBL2066304)
IC50>1000±n/a nM
Citation Hsu, JTYeh, TKYen, SCChen, CTHsieh, SYHsu, TLu, CTChen, CHChou, LHChiu, CHChang, YITseng, YJYen, KRChao, YSLin, WHJiaang, WT 3-Phenyl-1H-5-pyrazolylamine-based derivatives as potent and efficacious inhibitors of FMS-like tyrosine kinase-3 (FLT3). Bioorg Med Chem Lett22:4654-9 (2012) 
 
Vascular endothelial growth factor receptor 1
Name:Vascular endothelial growth factor receptor 1
Type:Receptor Tyrosine Kinase
Mol. Mass.:150800.23
Organism:Homo sapiens (Human)
Description:P17948
Residue:1338
BDBM50389215
NameBDBM50389215
Synonyms:CHEMBL2063329
TypeSmall organic molecule
Emp. Form.C30H32N6O4
Mol. Mass.540.6129
SMILESO=C(NCc1ccc(cc1)-c1cc(NC(=O)c2ccc(OCCN3CCCC3)cc2)[nH]n1)OCc1cccnc1