Reaction Details
TargetVascular endothelial growth factor receptor 1
LigandBDBM50389226
Substrate/Competitorn/a
Meas. Tech.ChEMBL_831540 (CHEMBL2066304)
IC50>1000±n/a nM
Citation Hsu, JTYeh, TKYen, SCChen, CTHsieh, SYHsu, TLu, CTChen, CHChou, LHChiu, CHChang, YITseng, YJYen, KRChao, YSLin, WHJiaang, WT 3-Phenyl-1H-5-pyrazolylamine-based derivatives as potent and efficacious inhibitors of FMS-like tyrosine kinase-3 (FLT3). Bioorg Med Chem Lett22:4654-9 (2012) 
 
Vascular endothelial growth factor receptor 1
Name:Vascular endothelial growth factor receptor 1
Type:Receptor Tyrosine Kinase
Mol. Mass.:150800.23
Organism:Homo sapiens (Human)
Description:P17948
Residue:1338
BDBM50389226
NameBDBM50389226
Synonyms:CHEMBL2063435
TypeSmall organic molecule
Emp. Form.C27H33N9O4
Mol. Mass.547.6088
SMILESCc1cc(COC(=O)NCc2ccc(cc2)-c2cc(Nc3cc(nc(C)n3)N3CCN(CCO)CC3)[nH]n2)no1