Reaction Details
TargetVascular endothelial growth factor receptor 2
LigandBDBM50389232
Substrate/Competitorn/a
Meas. Tech.ChEMBL_831541 (CHEMBL2066305)
IC50 560±n/a nM
Citation Hsu, JTYeh, TKYen, SCChen, CTHsieh, SYHsu, TLu, CTChen, CHChou, LHChiu, CHChang, YITseng, YJYen, KRChao, YSLin, WHJiaang, WT 3-Phenyl-1H-5-pyrazolylamine-based derivatives as potent and efficacious inhibitors of FMS-like tyrosine kinase-3 (FLT3). Bioorg Med Chem Lett22:4654-9 (2012) 
 
Vascular endothelial growth factor receptor 2
Name:Vascular endothelial growth factor receptor 2
Type:Receptor Tyrosine Kinase
Mol. Mass.:151510.97
Organism:Homo sapiens (Human)
Description:P35968
Residue:1356
BDBM50389232
NameBDBM50389232
Synonyms:CHEMBL2063322
TypeSmall organic molecule
Emp. Form.C25H30N6O3
Mol. Mass.462.5441
SMILESCCOC(=O)NCc1ccc(cc1)-c1cc(NC(=O)c2ccc(cc2)N2CCN(C)CC2)[nH]n1