Reaction Details
TargetVascular endothelial growth factor receptor 2
LigandBDBM50389234
Substrate/Competitorn/a
Meas. Tech.ChEMBL_831541 (CHEMBL2066305)
IC50 120±n/a nM
Citation Hsu, JTYeh, TKYen, SCChen, CTHsieh, SYHsu, TLu, CTChen, CHChou, LHChiu, CHChang, YITseng, YJYen, KRChao, YSLin, WHJiaang, WT 3-Phenyl-1H-5-pyrazolylamine-based derivatives as potent and efficacious inhibitors of FMS-like tyrosine kinase-3 (FLT3). Bioorg Med Chem Lett22:4654-9 (2012) 
 
Vascular endothelial growth factor receptor 2
Name:Vascular endothelial growth factor receptor 2
Type:Receptor Tyrosine Kinase
Mol. Mass.:151510.97
Organism:Homo sapiens (Human)
Description:P35968
Residue:1356
BDBM50389234
NameBDBM50389234
Synonyms:CHEMBL2063324
TypeSmall organic molecule
Emp. Form.C31H33N5O4
Mol. Mass.539.6248
SMILESO=C(NCc1ccc(cc1)-c1cc(NC(=O)c2ccc(OCCN3CCCC3)cc2)[nH]n1)OCc1ccccc1