Reaction Details
TargetAurora kinase B
LigandBDBM50389267
Substrate/Competitorn/a
Meas. Tech.ChEMBL_831558 (CHEMBL2064921)
IC50 12±n/a nM
Citation Ji, ZDai, YAbad-Zapatero, CAlbert, DHBouska, JJGlaser, KBMarcotte, PASoni, NBMagoc, TJStewart, KDWei, RQDavidsen, SKMichaelides, MR Exploration of diverse hinge-binding scaffolds for selective Aurora kinase inhibitors. Bioorg Med Chem Lett22:4528-31 (2012) 
 
Aurora kinase B
Name:Aurora kinase B
Type:Protein
Mol. Mass.:39327.72
Organism:Homo sapiens (Human)
Description:Q96GD4
Residue:344
BDBM50389267
NameBDBM50389267
Synonyms:CHEMBL2063447
TypeSmall organic molecule
Emp. Form.C23H18F3N5O3
Mol. Mass.469.4159
SMILESNc1noc2cccc(C(=O)Nc3cccc(CNC(=O)Nc4ccc(cc4)C(F)(F)F)c3)c12