Reaction Details
TargetAurora kinase B
LigandBDBM50389239
Substrate/Competitorn/a
Meas. Tech.ChEMBL_831558 (CHEMBL2064921)
IC50 59±n/a nM
Citation Ji, ZDai, YAbad-Zapatero, CAlbert, DHBouska, JJGlaser, KBMarcotte, PASoni, NBMagoc, TJStewart, KDWei, RQDavidsen, SKMichaelides, MR Exploration of diverse hinge-binding scaffolds for selective Aurora kinase inhibitors. Bioorg Med Chem Lett22:4528-31 (2012) 
 
Aurora kinase B
Name:Aurora kinase B
Type:Protein
Mol. Mass.:39327.72
Organism:Homo sapiens (Human)
Description:Q96GD4
Residue:344
BDBM50389239
NameBDBM50389239
Synonyms:CHEMBL2063446
TypeSmall organic molecule
Emp. Form.C22H18FN5O3
Mol. Mass.419.4084
SMILESNc1noc2cccc(C(=O)Nc3cccc(CNC(=O)Nc4cccc(F)c4)c3)c12