Reaction Details
TargetSerine/threonine-protein kinase Chk1
LigandBDBM50389241
Substrate/Competitorn/a
Meas. Tech.ChEMBL_831565 (CHEMBL2064928)
IC50>10000±n/a nM
Citation Ji, ZDai, YAbad-Zapatero, CAlbert, DHBouska, JJGlaser, KBMarcotte, PASoni, NBMagoc, TJStewart, KDWei, RQDavidsen, SKMichaelides, MR Exploration of diverse hinge-binding scaffolds for selective Aurora kinase inhibitors. Bioorg Med Chem Lett22:4528-31 (2012) 
 
Serine/threonine-protein kinase Chk1
Name:Serine/threonine-protein kinase Chk1
Type:Enzyme Catalytic Domain
Mol. Mass.:54443.02
Organism:Homo sapiens (Human)
Description:gi_166295192
Residue:476
BDBM50389241
NameBDBM50389241
Synonyms:CHEMBL1990583
TypeSmall organic molecule
Emp. Form.C20H16FN7O2
Mol. Mass.405.3851
SMILESNc1ncnn2ccc(C(=O)Nc3ccc(NC(=O)Nc4cccc(F)c4)cc3)c12