Reaction Details
TargetAurora kinase B
LigandBDBM50389258
Substrate/Competitorn/a
Meas. Tech.ChEMBL_831558 (CHEMBL2064921)
IC50 4±n/a nM
Citation Ji, ZDai, YAbad-Zapatero, CAlbert, DHBouska, JJGlaser, KBMarcotte, PASoni, NBMagoc, TJStewart, KDWei, RQDavidsen, SKMichaelides, MR Exploration of diverse hinge-binding scaffolds for selective Aurora kinase inhibitors. Bioorg Med Chem Lett22:4528-31 (2012) 
 
Aurora kinase B
Name:Aurora kinase B
Type:Protein
Mol. Mass.:39327.72
Organism:Homo sapiens (Human)
Description:Q96GD4
Residue:344
BDBM50389258
NameBDBM50389258
Synonyms:CHEMBL2063462
TypeSmall organic molecule
Emp. Form.C21H18FN7O2
Mol. Mass.419.4117
SMILESNc1ncnn2ccc(C(=O)Nc3cccc(CNC(=O)Nc4cccc(F)c4)c3)c12