Reaction Details
TargetAurora kinase B
LigandBDBM50389263
Substrate/Competitorn/a
Meas. Tech.ChEMBL_831558 (CHEMBL2064921)
IC50 33±n/a nM
Citation Ji, ZDai, YAbad-Zapatero, CAlbert, DHBouska, JJGlaser, KBMarcotte, PASoni, NBMagoc, TJStewart, KDWei, RQDavidsen, SKMichaelides, MR Exploration of diverse hinge-binding scaffolds for selective Aurora kinase inhibitors. Bioorg Med Chem Lett22:4528-31 (2012) 
 
Aurora kinase B
Name:Aurora kinase B
Type:Protein
Mol. Mass.:39327.72
Organism:Homo sapiens (Human)
Description:Q96GD4
Residue:344
BDBM50389263
NameBDBM50389263
Synonyms:CHEMBL2063466
TypeSmall organic molecule
Emp. Form.C19H21N7O2
Mol. Mass.379.4157
SMILESNc1ncnn2ccc(C(=O)Nc3ccc(NC(=O)NC4CCCC4)cc3)c12