Reaction Details
TargetAurora kinase A
LigandBDBM50389242
Substrate/Competitorn/a
Meas. Tech.ChEMBL_831557 (CHEMBL2064920)
IC50 12200±n/a nM
Citation Ji, ZDai, YAbad-Zapatero, CAlbert, DHBouska, JJGlaser, KBMarcotte, PASoni, NBMagoc, TJStewart, KDWei, RQDavidsen, SKMichaelides, MR Exploration of diverse hinge-binding scaffolds for selective Aurora kinase inhibitors. Bioorg Med Chem Lett22:4528-31 (2012) 
 
Aurora kinase A
Name:Aurora kinase A
Type:Serine/threonine-protein kinase
Mol. Mass.:45830.98
Organism:Homo sapiens (Human)
Description:O14965
Residue:403
BDBM50389242
NameBDBM50389242
Synonyms:CHEMBL2063442
TypeSmall organic molecule
Emp. Form.C22H18FN5O3
Mol. Mass.419.4084
SMILESNc1noc2cccc(C(=O)Nc3cccc(CNC(=O)Nc4ccc(F)cc4)c3)c12