Reaction Details
TargetAurora kinase A
LigandBDBM50389243
Substrate/Competitorn/a
Meas. Tech.ChEMBL_831557 (CHEMBL2064920)
IC50 1623±n/a nM
Citation Ji, ZDai, YAbad-Zapatero, CAlbert, DHBouska, JJGlaser, KBMarcotte, PASoni, NBMagoc, TJStewart, KDWei, RQDavidsen, SKMichaelides, MR Exploration of diverse hinge-binding scaffolds for selective Aurora kinase inhibitors. Bioorg Med Chem Lett22:4528-31 (2012) 
 
Aurora kinase A
Name:Aurora kinase A
Type:Serine/threonine-protein kinase
Mol. Mass.:45830.98
Organism:Homo sapiens (Human)
Description:O14965
Residue:403
BDBM50389243
NameBDBM50389243
Synonyms:CHEMBL2063456
TypeSmall organic molecule
Emp. Form.C22H18F2N6O2
Mol. Mass.436.4141
SMILESNc1n[nH]c2cccc(C(=O)Nc3cccc(CNC(=O)Nc4ccc(F)c(F)c4)c3)c12