Reaction Details
TargetMitogen-activated protein kinase 1
LigandBDBM50389241
Substrate/Competitorn/a
Meas. Tech.ChEMBL_831567 (CHEMBL2064930)
IC50 296±n/a nM
Citation Ji, ZDai, YAbad-Zapatero, CAlbert, DHBouska, JJGlaser, KBMarcotte, PASoni, NBMagoc, TJStewart, KDWei, RQDavidsen, SKMichaelides, MR Exploration of diverse hinge-binding scaffolds for selective Aurora kinase inhibitors. Bioorg Med Chem Lett22:4528-31 (2012) 
 
Mitogen-activated protein kinase 1
Name:Mitogen-activated protein kinase 1
Type:Ser/Thr Protein Kinase
Mol. Mass.:41392.76
Organism:Homo sapiens (Human)
Description:P28482
Residue:360
BDBM50389241
NameBDBM50389241
Synonyms:CHEMBL1990583
TypeSmall organic molecule
Emp. Form.C20H16FN7O2
Mol. Mass.405.3851
SMILESNc1ncnn2ccc(C(=O)Nc3ccc(NC(=O)Nc4cccc(F)c4)cc3)c12