Reaction Details
TargetAurora kinase A
LigandBDBM50389247
Substrate/Competitorn/a
Meas. Tech.ChEMBL_831557 (CHEMBL2064920)
IC50>12500±n/a nM
Citation Ji, ZDai, YAbad-Zapatero, CAlbert, DHBouska, JJGlaser, KBMarcotte, PASoni, NBMagoc, TJStewart, KDWei, RQDavidsen, SKMichaelides, MR Exploration of diverse hinge-binding scaffolds for selective Aurora kinase inhibitors. Bioorg Med Chem Lett22:4528-31 (2012) 
 
Aurora kinase A
Name:Aurora kinase A
Type:Serine/threonine-protein kinase
Mol. Mass.:45830.98
Organism:Homo sapiens (Human)
Description:O14965
Residue:403
BDBM50389247
NameBDBM50389247
Synonyms:CHEMBL2063449
TypeSmall organic molecule
Emp. Form.C15H14N4O2
Mol. Mass.282.2973
SMILESNCc1cccc(NC(=O)c2cccc3onc(N)c23)c1