Reaction Details
TargetAurora kinase A
LigandBDBM50389254
Substrate/Competitorn/a
Meas. Tech.ChEMBL_831557 (CHEMBL2064920)
IC50>12500±n/a nM
Citation Ji, ZDai, YAbad-Zapatero, CAlbert, DHBouska, JJGlaser, KBMarcotte, PASoni, NBMagoc, TJStewart, KDWei, RQDavidsen, SKMichaelides, MR Exploration of diverse hinge-binding scaffolds for selective Aurora kinase inhibitors. Bioorg Med Chem Lett22:4528-31 (2012) 
 
Aurora kinase A
Name:Aurora kinase A
Type:Serine/threonine-protein kinase
Mol. Mass.:45830.98
Organism:Homo sapiens (Human)
Description:O14965
Residue:403
BDBM50389254
NameBDBM50389254
Synonyms:CHEMBL2063440
TypeSmall organic molecule
Emp. Form.C21H16ClN5O3
Mol. Mass.421.836
SMILESNc1noc2cccc(C(=O)Nc3ccc(NC(=O)Nc4ccc(Cl)cc4)cc3)c12