Reaction Details
TargetEpidermal growth factor receptor
LigandBDBM50389241
Substrate/Competitorn/a
Meas. Tech.ChEMBL_831566 (CHEMBL2064929)
IC50 2090±n/a nM
Citation Ji, ZDai, YAbad-Zapatero, CAlbert, DHBouska, JJGlaser, KBMarcotte, PASoni, NBMagoc, TJStewart, KDWei, RQDavidsen, SKMichaelides, MR Exploration of diverse hinge-binding scaffolds for selective Aurora kinase inhibitors. Bioorg Med Chem Lett22:4528-31 (2012) 
 
Epidermal growth factor receptor
Name:Epidermal growth factor receptor
Type:Receptor Kinase Domain
Mol. Mass.:134279.59
Organism:Homo sapiens (Human)
Description:P00533
Residue:1210
BDBM50389241
NameBDBM50389241
Synonyms:CHEMBL1990583
TypeSmall organic molecule
Emp. Form.C20H16FN7O2
Mol. Mass.405.3851
SMILESNc1ncnn2ccc(C(=O)Nc3ccc(NC(=O)Nc4cccc(F)c4)cc3)c12