Reaction Details
TargetSerine/threonine-protein kinase mTOR
LigandBDBM50389282
Substrate/Competitorn/a
Meas. Tech.ChEMBL_831689 (CHEMBL2065052)
Ki 50±n/a nM
Citation Liu, KKBailey, SDinh, DMLam, HLi, CWells, PAYin, MJZou, A Conformationally-restricted cyclic sulfones as potent and selective mTOR kinase inhibitors. Bioorg Med Chem Lett22:5114-7 (2012) 
 
Serine/threonine-protein kinase mTOR
Name:Serine/threonine-protein kinase mTOR
Type:Rapamycin target protein
Mol. Mass.:288917.12
Organism:Homo sapiens (Human)
Description:P42345
Residue:2549
BDBM50389282
NameBDBM50389282
Synonyms:CHEMBL2063754
TypeSmall organic molecule
Emp. Form.C20H25N5O4S
Mol. Mass.431.509
SMILESCCNC(=O)Nc1ccc(cc1)-c1nc2CCS(=O)(=O)Cc2c(n1)N1CCOCC1