Reaction Details
TargetSerine/threonine-protein kinase mTOR
LigandBDBM50389287
Substrate/Competitorn/a
Meas. Tech.ChEMBL_831689 (CHEMBL2065052)
Ki 13±n/a nM
Citation Liu, KKBailey, SDinh, DMLam, HLi, CWells, PAYin, MJZou, A Conformationally-restricted cyclic sulfones as potent and selective mTOR kinase inhibitors. Bioorg Med Chem Lett22:5114-7 (2012) 
 
Serine/threonine-protein kinase mTOR
Name:Serine/threonine-protein kinase mTOR
Type:Rapamycin target protein
Mol. Mass.:288917.12
Organism:Homo sapiens (Human)
Description:P42345
Residue:2549
BDBM50389287
NameBDBM50389287
Synonyms:CHEMBL2063752
TypeSmall organic molecule
Emp. Form.C20H25N5O4S
Mol. Mass.431.509
SMILESCCNC(=O)Nc1ccc(cc1)-c1nc2CS(=O)(=O)Cc2c(n1)N1CCOC[C@H]1C