Reaction Details
TargetSerine/threonine-protein kinase mTOR
LigandBDBM50389289
Substrate/Competitorn/a
Meas. Tech.ChEMBL_831689 (CHEMBL2065052)
Ki 52±n/a nM
Citation Liu, KKBailey, SDinh, DMLam, HLi, CWells, PAYin, MJZou, A Conformationally-restricted cyclic sulfones as potent and selective mTOR kinase inhibitors. Bioorg Med Chem Lett22:5114-7 (2012) 
 
Serine/threonine-protein kinase mTOR
Name:Serine/threonine-protein kinase mTOR
Type:Rapamycin target protein
Mol. Mass.:288917.12
Organism:Homo sapiens (Human)
Description:P42345
Residue:2549
BDBM50389289
NameBDBM50389289
Synonyms:CHEMBL2063755
TypeSmall organic molecule
Emp. Form.C21H27N5O4S
Mol. Mass.445.535
SMILESCCNC(=O)Nc1ccc(cc1)-c1nc2CCS(=O)(=O)Cc2c(n1)N1CCOC[C@H]1C