Reaction Details
TargetActivin receptor type-1B
LigandBDBM50389320
Substrate/Competitorn/a
Meas. Tech.ChEMBL_831772 (CHEMBL2065135)
IC50<10000±n/a nM
Citation Maryanoff, BEO'Neill, JCMcComsey, DFYabut, SCLuci, DKGibbs, ACConnelly, MA Pyrimidinopyrimidine inhibitors of ketohexokinase: exploring the ring C2 group that interacts with Asp-27B in the ligand binding pocket. Bioorg Med Chem Lett22:5326-9 (2012) 
 
Activin receptor type-1B
Name:Activin receptor type-1B
Type:PROTEIN
Mol. Mass.:56810.99
Organism:Homo sapiens (Human)
Description:ChEMBL_587064
Residue:505
BDBM50389320
NameBDBM50389320
Synonyms:CHEMBL2063926
TypeSmall organic molecule
Emp. Form.C26H35N9S
Mol. Mass.505.681
SMILESCSc1ccccc1Nc1nc(nc2c(NCC3CC3)ncnc12)N1CCN(CC1)C1CCNCC1