Reaction Details
TargetProtein kinase C theta type
LigandBDBM50389320
Substrate/Competitorn/a
Meas. Tech.ChEMBL_831797 (CHEMBL2065160)
IC50<10000±n/a nM
Citation Maryanoff, BEO'Neill, JCMcComsey, DFYabut, SCLuci, DKGibbs, ACConnelly, MA Pyrimidinopyrimidine inhibitors of ketohexokinase: exploring the ring C2 group that interacts with Asp-27B in the ligand binding pocket. Bioorg Med Chem Lett22:5326-9 (2012) 
 
Protein kinase C theta type
Name:Protein kinase C theta type
Type:Serine/threonine-protein kinase
Mol. Mass.:81878.04
Organism:Homo sapiens (Human)
Description:Full-length human PKC theta (Panvera Catalog No. P2996).
Residue:706
BDBM50389320
NameBDBM50389320
Synonyms:CHEMBL2063926
TypeSmall organic molecule
Emp. Form.C26H35N9S
Mol. Mass.505.681
SMILESCSc1ccccc1Nc1nc(nc2c(NCC3CC3)ncnc12)N1CCN(CC1)C1CCNCC1