Reaction Details
TargetKetohexokinase
LigandBDBM50389315
Substrate/Competitorn/a
Meas. Tech.ChEMBL_831738 (CHEMBL2065101)
IC50 4600±n/a nM
Citation Maryanoff, BEO'Neill, JCMcComsey, DFYabut, SCLuci, DKGibbs, ACConnelly, MA Pyrimidinopyrimidine inhibitors of ketohexokinase: exploring the ring C2 group that interacts with Asp-27B in the ligand binding pocket. Bioorg Med Chem Lett22:5326-9 (2012) 
 
Ketohexokinase
Name:Ketohexokinase
Type:Enzyme Catalytic Domain
Mol. Mass.:32521.64
Organism:Homo sapiens (Human)
Description:n/a
Residue:298
BDBM50389315
NameBDBM50389315
Synonyms:CHEMBL2063920
TypeSmall organic molecule
Emp. Form.C22H26N8S
Mol. Mass.434.56
SMILESCSc1ccccc1Nc1nc(nc2c(NCC3CC3)ncnc12)N1C[C@@H]2C[C@H]1CN2